Tuesday, 16 June 2015

travis ci


below is a wrong script:



you will have this error:





:app:packageDebugAndroidTest
:app:assembleDebugAndroidTest
:app:connectedAndroidTestDebug
Tests on test(AVD) - 4.4.2 failed: No test results
com.android.builder.testing.ConnectedDevice > No tests found.[test(AVD) - 4.4.2] FAILED
No tests found. This usually means that your test classes are not in the form that your test runner expects (e.g. don't inherit from TestCase or lack @Test annotations).
:app:connectedAndroidTestDebug FAILED
FAILURE: Build failed with an exception.



below is the right script:












No comments:

Post a comment